{"text_format":"1","workbook":"xlsx","n_sheets":30,"sheets":["Pivot 3,5-16","Utdata 3,5-16","Utfall_3,5-16","Pivot över 16 ton","Utdata över 16 ton","Över 16 ton","Pivot tunga totalt","Utdata tungt","Pivot BE","Utdata BE","Pivot Märken","Utdata märken","Pivot B System","Utdata B System","B_System","Pivot B Komponent","Utdata B Komponent","Pivot BE System","BE System","Utdata BE System","Pivot BE Komponent","BE Komponent","Utdata BE Komponent","Pivot Däck 2013 Q1","Däck","Utdata Däck","B_Komponent","Märken","BE","Tunga totalt"],"not_rendered":{"charts":0,"images":0,"macros":1,"external_links":0,"defined_names":4,"comments":0,"pivot_tables":10},"unopened":[],"bounds":{"document_bytes":16777216,"sheet_cells":100000,"rows_first":2000,"rows_last":500,"rows_between":2000,"halvings":0,"cell_chars":16384,"cell_head_chars":4096},"cells_cut":0,"cells_raw":0,"read":"whole","date_system":"1900"}

{"sheet":"Pivot 3,5-16","index":0,"n_rows":25,"n_cols":7,"rows_kept":25,"cut":false,"hidden":true,"merged":[]}
[]
[]
["Radetiketter","Summa av 0 Godkänd","Summa av 2 Underkänd Med Efterk","Summa av 3 Körförbud","Summa av 6 Underkänd Utan Efterk","Summa av U Underkänd Fle","Summa av Utfall"]
["1 Stockholms län",315,265,3,199,0,782]
["3 Uppsala län",94,93,2,63,0,252]
["4 Södermanlands län",60,86,0,30,0,176]
["5 Östergötlands län",120,108,1,84,0,313]
["6 Jönköpings län",270,209,1,166,0,646]
{"$rows_left_out":18}
{"sheet":"Utdata 3,5-16","index":1,"n_rows":24,"n_cols":10,"rows_kept":24,"cut":false,"hidden":false,"merged":[]}
["Kontrollbesiktning tunga lastbilar 3,5-16 ton, 2013"]
["Län","Summa av 0 Godkänd","Summa av 2 Underkänd Med Efterk","Summa av 3 Körförbud","Summa av 6 Underkänd Utan Efterk","Summa av U Underkänd Fle","Antal besiktade","Andel underkända","Andel underkända med efterkontroll","Andel körförbud"]
["1 Stockholms län",315,265,3,199,0,782,{"$f":"(C3+D3+E3+F3)/G3","v":0.59718670076726343},{"$f":"C3/G3","v":0.33887468030690537},{"$f":"D3/G3","v":3.8363171355498722E-3}]
["3 Uppsala län",94,93,2,63,0,252,{"$f":"(C4+D4+E4+F4)/G4","v":0.62698412698412698},{"$f":"C4/G4","v":0.36904761904761907},{"$f":"D4/G4","v":7.9365079365079361E-3}]
["4 Södermanlands län",60,86,0,30,0,176,0.65909090909090906,0.48863636363636365,0]
["5 Östergötlands län",120,108,1,84,0,313,0.61661341853035145,0.34504792332268369,3.1948881789137379E-3]
["6 Jönköpings län",270,209,1,166,0,646,0.58204334365325072,0.3235294117647059,1.5479876160990713E-3]
["7 Kronobergs län",90,162,1,74,0,327,0.72477064220183485,0.49541284403669728,3.0581039755351682E-3]
{"$rows_left_out":17}
{"sheet":"Utfall_3,5-16","index":2,"n_rows":102,"n_cols":8,"rows_kept":102,"cut":false,"hidden":true,"merged":[]}
[]
["Stn","Län","0 Godkänd","2 Underkänd Med Efterk","3 Körförbud","6 Underkänd Utan Efterk","U Underkänd Fle","Utfall"]
["0418 Sollentuna","1 Stockholms län",145,118,1,105,0,369]
["0317 Gävle-Sörby Urfjäll","21 Gävleborgs län",122,147,1,53,0,323]
["0876 Jönköping-Torsvik","6 Jönköpings län",137,89,0,97,0,323]
["0536 Norrköping-Herstadberg","5 Östergötlands län",99,92,1,75,0,267]
["0523 Västerås-Tunbytorp","19 Västmanlands län",87,113,1,64,0,265]
["0873 Växjö","7 Kronobergs län",56,121,0,56,0,233]
{"$rows_left_out":95}
{"sheet":"Pivot över 16 ton","index":3,"n_rows":25,"n_cols":7,"rows_kept":25,"cut":false,"hidden":true,"merged":[]}
[]
[]
["Radetiketter","Summa av 0 Godkänd","Summa av 2 Underkänd Med Efterk","Summa av 3 Körförbud","Summa av 6 Underkänd Utan Efterk","Summa av U Underkänd Fle","Summa av Utfall"]
["1 Stockholms län",653,1036,7,503,0,2199]
["3 Uppsala län",169,292,17,126,0,604]
["4 Södermanlands län",160,326,6,123,0,615]
["5 Östergötlands län",355,420,6,181,1,963]
["6 Jönköpings län",818,1104,13,593,0,2528]
{"$rows_left_out":18}
{"sheet":"Utdata över 16 ton","index":4,"n_rows":24,"n_cols":10,"rows_kept":24,"cut":false,"hidden":false,"merged":[]}
["Kontrollbesiktning tunga lastbilar > 16 ton, 2013"]
["Län","Summa av 0 Godkänd","Summa av 2 Underkänd Med Efterk","Summa av 3 Körförbud","Summa av 6 Underkänd Utan Efterk","Summa av U Underkänd Fle","Antal besiktade","Andel underkända","Andel underkända med efterkontroll","Andel körförbud"]
["1 Stockholms län",653,1036,7,503,0,2199,{"$f":"(C3+D3+E3+F3)/G3","v":0.70304683947248747},{"$f":"C3/G3","v":0.47112323783537974},{"$f":"D3/G3","v":3.1832651205093224E-3}]
["3 Uppsala län",169,292,17,126,0,604,{"$f":"(C4+D4+E4+F4)/G4","v":0.7201986754966887},{"$f":"C4/G4","v":0.48344370860927155},{"$f":"D4/G4","v":2.8145695364238412E-2}]
["4 Södermanlands län",160,326,6,123,0,615,0.73983739837398377,0.53008130081300808,9.7560975609756097E-3]
["5 Östergötlands län",355,420,6,181,1,963,0.63136033229491173,0.43613707165109034,6.2305295950155761E-3]
["6 Jönköpings län",818,1104,13,593,0,2528,0.67642405063291144,0.43670886075949367,5.1424050632911389E-3]
["7 Kronobergs län",330,556,5,224,0,1115,0.70403587443946192,0.49865470852017935,4.4843049327354259E-3]
{"$rows_left_out":17}
{"sheet":"Över 16 ton","index":5,"n_rows":100,"n_cols":8,"rows_kept":100,"cut":false,"hidden":true,"merged":[]}
[]
["Stn","Län","0 Godkänd","2 Underkänd Med Efterk","3 Körförbud","6 Underkänd Utan Efterk","U Underkänd Fle","Utfall"]
["0876 Jönköping-Torsvik","6 Jönköpings län",483,503,4,314,0,1304]
["0967 Helsingborg-Ättekulla","12 Skåne län",374,404,1,273,0,1052]
["0317 Gävle-Sörby Urfjäll","21 Gävleborgs län",240,559,8,155,0,962]
["0523 Västerås-Tunbytorp","19 Västmanlands län",241,466,7,196,0,910]
["0418 Sollentuna","1 Stockholms län",247,395,5,237,0,884]
["0729 Varberg","13 Hallands län",372,362,3,139,0,876]
{"$rows_left_out":93}
{"sheet":"Pivot tunga totalt","index":6,"n_rows":25,"n_cols":7,"rows_kept":25,"cut":false,"hidden":true,"merged":[]}
[]
[]
["Radetiketter","Summa av 0 Godkänd","Summa av 2 Underkänd Med Efterk","Summa av 3 Körförbud","Summa av 6 Underkänd Utan Efterk","Summa av U Underkänd Fle","Summa av Utfall"]
["1 Stockholms län",968,1301,10,702,0,2981]
["3 Uppsala län",263,385,19,189,0,856]
["4 Södermanlands län",220,412,6,153,0,791]
["5 Östergötlands län",475,528,7,265,1,1276]
["6 Jönköpings län",1088,1313,14,759,0,3174]
{"$rows_left_out":18}
{"sheet":"Utdata tungt","index":7,"n_rows":25,"n_cols":16,"rows_kept":25,"cut":false,"hidden":false,"merged":[]}
[]
["Kontrollbesiktning tunga lastbilar > 3,5 ton, 2013"]
["Län","Summa av 0 Godkänd","Summa av 2 Underkänd Med Efterk","Summa av 3 Körförbud","Summa av 6 Underkänd Utan Efterk","Summa av U Underkänd Fle","Antal besiktade","Andel underkända","Andel underkända med efterkontroll","Andel körförbud","För jämförelse: Antal besiktade 2012","För jämförelse: relativ ändring volym"]
["1 Stockholms län",968,1301,10,702,0,2981,{"$f":"(C4+D4+E4+F4)/G4","v":0.67527675276752763},{"$f":"C4/G4","v":0.43643072794364307},{"$f":"D4/G4","v":3.3545790003354577E-3},{"$f":"VLOOKUP(A4,$O$4:$P$24,2,0)","v":9327},{"$f":"(G4-K4)/K4","v":-0.68039026482255816},null,null,"1 Stockholms län",9327]
["3 Uppsala län",263,385,19,189,0,856,{"$f":"(C5+D5+E5+F5)/G5","v":0.69275700934579443},{"$f":"C5/G5","v":0.44976635514018692},{"$f":"D5/G5","v":2.219626168224299E-2},{"$f":"VLOOKUP(A5,$O$4:$P$24,2,0)","v":2161},{"$f":"(G5-K5)/K5","v":-0.60388708931050439},null,null,"3 Uppsala län",2161]
["4 Södermanlands län",220,412,6,153,0,791,0.7218710493046776,0.52085967130214916,7.5853350189633373E-3,{"$f":"VLOOKUP(A6,$O$4:$P$24,2,0)","v":2004},-0.60528942115768458,null,null,"4 Södermanlands län",2004]
["5 Östergötlands län",475,528,7,265,1,1276,0.62774294670846398,0.41379310344827586,5.4858934169278997E-3,{"$f":"VLOOKUP(A7,$O$4:$P$24,2,0)","v":2955},-0.56818950930626055,null,null,"5 Östergötlands län",2955]
["6 Jönköpings län",1088,1313,14,759,0,3174,0.65721487082545682,0.41367359798361691,4.4108380592312538E-3,{"$f":"VLOOKUP(A8,$O$4:$P$24,2,0)","v":3767},-0.157419697371914,null,null,"6 Jönköpings län",3767]
{"$rows_left_out":18}
{"sheet":"Pivot BE","index":8,"n_rows":27,"n_cols":13,"rows_kept":27,"cut":false,"hidden":true,"merged":[]}
[]
[]
[null,"Kolumnetiketter"]
[null,"> 16000",null,null,null,"3,5-16 ton",null,null,null,"Tunga samtliga"]
["Radetiketter","Summa av 0 Godkänd","Summa av 2 Underkänd Med Efterk","Summa av 3 Körförbud","Summa av Utfall","Summa av 0 Godkänd","Summa av 2 Underkänd Med Efterk","Summa av 3 Körförbud","Summa av Utfall","Summa av 0 Godkänd","Summa av 2 Underkänd Med Efterk","Summa av 3 Körförbud","Summa av Utfall"]
["1 Stockholms län",293,86,1,380,115,24,0,139,408,110,1,519]
["10 Blekinge län",87,6,0,93,18,2,0,20,105,8,0,113]
["12 Skåne län",617,115,0,732,169,26,0,195,786,141,0,927]
{"$rows_left_out":20}
{"sheet":"Utdata BE","index":9,"n_rows":25,"n_cols":16,"rows_kept":25,"cut":false,"hidden":false,"merged":[]}
["Andel underkända vid efterkontroll per län","Kolumnetiketter"]
[null,"> 16000",null,null,null,"3,5-16 ton",null,null,null,"3,5-16 ton","Tunga samtliga",null,null,null,"Över 16 ton","Tunga, samtliga viktklasser"]
["Län","Summa av 0 Godkänd","Summa av 2 Underkänd Med Efterk","Summa av 3 Körförbud","Summa av Utfall","Summa av 0 Godkänd","Summa av 2 Underkänd Med Efterk","Summa av 3 Körförbud","Summa av Utfall","Andel underkända","Summa av 0 Godkänd","Summa av 2 Underkänd Med Efterk","Summa av 3 Körförbud","Summa av Utfall","Andel underkända","Andel underkända"]
["1 Stockholms län",293,86,1,380,115,24,0,139,{"$f":"(G4+H4)/I4","v":0.17266187050359713},408,110,1,519,{"$f":"(C4+D4)/E4","v":0.22894736842105262},{"$f":"(L4+M4)/N4","v":0.2138728323699422}]
["3 Uppsala län",148,29,1,178,51,11,0,62,0.17741935483870969,199,40,1,240,0.16853932584269662,0.17083333333333334]
["4 Södermanlands län",95,48,3,146,41,9,0,50,0.18,136,57,3,196,0.34931506849315069,0.30612244897959184]
["5 Östergötlands län",160,40,2,202,66,9,0,75,0.12,226,49,2,277,0.20792079207920791,0.18411552346570398]
["6 Jönköpings län",372,69,2,443,109,13,0,122,0.10655737704918032,481,82,2,565,0.16027088036117382,0.14867256637168141]
{"$rows_left_out":18}
{"sheet":"Pivot Märken","index":10,"n_rows":52,"n_cols":19,"rows_kept":52,"cut":false,"hidden":true,"merged":[]}
[]
[]
[null,"Kolumnetiketter"]
[null,"> 16000",null,null,null,null,null,"3,5-16 ton",null,null,null,null,null,"Tunga samtliga"]
["Radetiketter","Summa av 0 Godkänd","Summa av 2 Underkänd Med Efterk","Summa av 3 Körförbud","Summa av 6 Underkänd Utan Efterk","Summa av U Underkänd Fle","Summa av Utfall","Summa av 0 Godkänd","Summa av 2 Underkänd Med Efterk","Summa av 3 Körförbud","Summa av 6 Underkänd Utan Efterk","Summa av U Underkänd Fle","Summa av Utfall","Summa av 0 Godkänd","Summa av 2 Underkänd Med Efterk","Summa av 3 Körförbud","Summa av 6 Underkänd Utan Efterk","Summa av U Underkänd Fle","Summa av Utfall"]
["VOLVO",3654,5018,36,2307,0,11015,1209,1182,13,719,0,3123,4863,6200,49,3026,0,14138]
["SCANIA/SCANIA-VABIS",4218,6082,128,2382,0,12810,321,125,2,113,0,561,4539,6207,130,2495,0,13371]
["MERCEDES-BENZ",550,506,4,372,0,1432,788,843,9,511,0,2151,1338,1349,13,883,0,3583]
{"$rows_left_out":45}
{"sheet":"Utdata märken","index":11,"n_rows":52,"n_cols":24,"rows_kept":52,"cut":false,"hidden":false,"merged":[]}
[]
[]
["Besiktningsresultat per märke (de vanligaste märkena)","Kolumnetiketter"]
[null,"> 16000",null,null,null,null,null,null,"3,5-16 ton",null,null,null,null,"3,5-16 ton","3,5-16 ton","Tunga samtliga",null,null,null,null,"Över 16 ton","Över 16 ton","Tunga, samtliga viktklasser"]
["Märke","Summa av 0 Godkänd","Summa av 2 Underkänd Med Efterk","Summa av 3 Körförbud","Summa av 6 Underkänd Utan Efterk","Summa av U Underkänd Fle",null,null,"Summa av 0 Godkänd","Summa av 2 Underkänd Med Efterk","Summa av 3 Körförbud","Summa av 6 Underkänd Utan Efterk","Summa av U Underkänd Fle","Antal besiktade","Andel underkända med efterkontroll","Summa av 0 Godkänd","Summa av 2 Underkänd Med Efterk","Summa av 3 Körförbud","Summa av 6 Underkänd Utan Efterk","Summa av U Underkänd Fle","Antal besiktade","Andel underkända med efterkontroll","Antal besiktade","Andel underkända med efterkontroll"]
["VOLVO",3654,5018,36,2307,0,null,null,1209,1182,13,719,0,3123,{"$f":"(J6/N6)","v":0.37848222862632086},4863,6200,49,3026,0,11015,{"$f":"(C6/U6)","v":0.45556059918293235},14138,{"$f":"(Q6/W6)","v":0.43853444617343329}]
["SCANIA/SCANIA-VABIS",4218,6082,128,2382,0,null,null,321,125,2,113,0,561,{"$f":"(J7/N7)","v":0.22281639928698752},4539,6207,130,2495,0,12810,0.47478532396565182,13371,{"$f":"(Q7/W7)","v":0.46421359658963429}]
["MERCEDES-BENZ",550,506,4,372,0,null,null,788,843,9,511,0,2151,0.39191073919107394,1338,1349,13,883,0,1432,0.35335195530726254,3583,0.37650013954786493]
{"$rows_left_out":45}
{"sheet":"Pivot B System","index":12,"n_rows":16,"n_cols":10,"rows_kept":16,"cut":false,"hidden":true,"merged":[]}
[]
[]
[null,"Kolumnetiketter"]
[null,"> 16000",null,null,"3,5-16 ton",null,null,"Tunga samtliga"]
["Radetiketter","Summa av 2 Underkänd Med Efterk","Summa av 3 Körförbud","Summa av X Underkänd Utan Efterk","Summa av 2 Underkänd Med Efterk","Summa av 3 Körförbud","Summa av X Underkänd Utan Efterk","Summa av 2 Underkänd Med Efterk","Summa av 3 Körförbud","Summa av X Underkänd Utan Efterk"]
["1. Stomme",682,3,351,231,1,127,913,4,478]
["2. Hjulsystem",4015,25,1211,782,5,213,4797,30,1424]
["3. Drivsystem",1220,0,1827,421,0,456,1641,0,2283]
{"$rows_left_out":9}
{"sheet":"Utdata B System","index":13,"n_rows":15,"n_cols":13,"rows_kept":15,"cut":false,"hidden":false,"merged":[]}
[]
[]
["Andel underkända per systemdel","Kolumnetiketter"]
[null,"> 16000",null,null,"3,5-16 ton",null,null,"3,5-16 ton","Tunga samtliga",null,null,"Över 16 ton","Tunga, samtliga viktklasser"]
["1. Stomme",682,3,351,231,1,127,{"$f":"SUM(E5:G5)/Antal_besiktade_3_5_till_16","v":4.4353842352359771E-2},913,4,478,{"$f":"(B5+C5+D5)/Antal_besiktade_16_ton","v":3.9304954852416724E-2},{"$f":"SUM(I5:K5)/(Antal_besiktade_16_ton+Antal_besiktade_3_5_till_16)","v":4.0491118077324972E-2}]
["2. Hjulsystem",4015,25,1211,782,5,213,0.12354830738818878,4797,30,1424,0.19921845360042492,0.18144084523394868]
["3. Drivsystem",1220,0,1827,421,0,456,0.10835186557944156,1641,0,2283,0.11560057667501328,0.11389759665621735]
["4. Bromssystem",7215,135,301,1938,24,103,0.25512725475660986,9153,159,404,0.29027240306548296,0.28201555787762683]
{"$rows_left_out":8}
{"sheet":"B_System","index":14,"n_rows":66,"n_cols":6,"rows_kept":66,"cut":false,"hidden":true,"merged":[]}
["Viktklass","System","2 Underkänd Med Efterk","3 Körförbud","J Justering","X Underkänd Utan Efterk"]
["3,5-16 ton","1. Stomme",25,0,0,16]
["3,5-16 ton","2. Hjulsystem",94,0,0,18]
["3,5-16 ton","3. Drivsystem",69,0,0,58]
["3,5-16 ton","4. Bromssystem",234,4,0,8]
["3,5-16 ton","5. Styrsystem",55,0,0,1]
["3,5-16 ton","6. Karosseri",25,0,0,74]
["3,5-16 ton","7. Kommunikation",114,0,7,369]
{"$rows_left_out":59}
{"sheet":"Pivot B Komponent","index":15,"n_rows":116,"n_cols":10,"rows_kept":116,"cut":false,"hidden":true,"merged":[]}
[]
[]
[null,"Kolumnetiketter"]
[null,"> 16000",null,null,"3,5-16 ton",null,null,"Tunga samtliga"]
["Radetiketter","Summa av 2 Underkänd Med Efterk","Summa av 3 Körförbud","Summa av X Underkänd Utan Efterk","Summa av 2 Underkänd Med Efterk","Summa av 3 Körförbud","Summa av X Underkänd Utan Efterk","Summa av 2 Underkänd Med Efterk","Summa av 3 Körförbud","Summa av X Underkänd Utan Efterk"]
["1.1.1 Ram",296,1,0,115,1,0,411,2,0]
["1.1.2 Balkprofil",160,0,0,79,0,1,239,0,1]
["1.1.3 Plåtyta",8,0,0,15,0,0,23,0,0]
{"$rows_left_out":109}
{"sheet":"Utdata B Komponent","index":16,"n_rows":116,"n_cols":13,"rows_kept":116,"cut":false,"hidden":false,"merged":[]}
[]
[]
["Andel underkända per komponent","Kolumnetiketter"]
[null,"> 16000",null,null,"3,5-16 ton",null,null,"3,5-16 ton","Tunga samtliga",null,null,"Över 16 ton","Tunga, samtliga viktklasser"]
["Komponent","Summa av 2 Underkänd Med Efterk","Summa av 3 Körförbud","Summa av X Underkänd Utan Efterk","Summa av 2 Underkänd Med Efterk","Summa av 3 Körförbud","Summa av X Underkänd Utan Efterk","Andel underkända","Summa av 2 Underkänd Med Efterk","Summa av 3 Körförbud","Summa av X Underkänd Utan Efterk","Andel underkända","Andel underkända"]
["1.1.1 Ram",296,1,0,115,1,0,{"$f":"(E6+F6+G6)/Antal_besiktade_3_5_till_16","v":1.4331603657029899E-2},411,2,0,{"$f":"(B6+C6+D6)/Antal_besiktade_16_ton","v":1.1267926246300934E-2},{"$f":"(I6+J6+K6)/(Antal_besiktade_3_5_till_16+Antal_besiktade_16_ton)","v":1.1987693022175781E-2}]
["1.1.2 Balkprofil",160,0,0,79,0,1,9.8838645910551033E-3,239,0,1,6.0702632976705369E-3,6.966213862765587E-3]
["1.1.3 Plåtyta",8,0,0,15,0,0,1.8532246108228317E-3,23,0,0,3.035131648835268E-4,6.6759549518170206E-4]
{"$rows_left_out":109}
{"sheet":"Pivot BE System","index":17,"n_rows":17,"n_cols":7,"rows_kept":17,"cut":false,"hidden":true,"merged":[]}
[]
[]
[null,"Kolumnetiketter"]
[null,"> 16000",null,"3,5-16 ton",null,"Tunga samtliga"]
["Radetiketter","Summa av 2 Underkänd Med Efterk","Summa av 3 Körförbud","Summa av 2 Underkänd Med Efterk","Summa av 3 Körförbud","Summa av 2 Underkänd Med Efterk","Summa av 3 Körförbud"]
["1. Stomme",43,0,14,0,57,0]
["2. Hjulsystem",127,0,22,0,149,0]
["3. Drivsystem",98,1,24,0,122,1]
{"$rows_left_out":10}
{"sheet":"BE System","index":18,"n_rows":69,"n_cols":6,"rows_kept":69,"cut":false,"hidden":true,"merged":[]}
["System - Antal fordon m brister\nas values","System","2 Underkänd Med Efterk","3 Körförbud","G Godkänd","J Justering"]
["3,5-16 ton","1. Stomme",0,0,17,0]
["3,5-16 ton","2. Hjulsystem",2,0,54,0]
["3,5-16 ton","3. Drivsystem",1,0,49,0]
["3,5-16 ton","4. Bromssystem",21,0,135,0]
["3,5-16 ton","5. Styrsystem",0,0,34,0]
["3,5-16 ton","6. Karosseri",2,0,34,0]
["3,5-16 ton","7. Kommunikation",4,0,139,0]
{"$rows_left_out":62}
{"sheet":"Utdata BE System","index":19,"n_rows":17,"n_cols":10,"rows_kept":17,"cut":false,"hidden":false,"merged":[]}
[]
[]
["Andel underkända vid efterkontroll per system","Kolumnetiketter"]
[null,"> 16000",null,"3,5-16 ton",null,"3,5-16 ton","Tunga samtliga",null,"Över 16 ton","Tunga, samtliga viktklasser"]
["Radetiketter","Summa av 2 Underkänd Med Efterk","Summa av 3 Körförbud","Summa av 2 Underkänd Med Efterk","Summa av 3 Körförbud","Andel underkända","Summa av 2 Underkänd Med Efterk","Summa av 3 Körförbud","Andel underkända","Andel underkända"]
["1. Stomme",43,0,14,0,{"$f":"(D6+E6)/Antal_BE_35_16","v":7.0105157736604909E-3},57,0,{"$f":"(B6+C6)/Antal_BE_Över_16","v":7.5056728923023211E-3},{"$f":"(G6+H6)/(Antal_BE_35_16+Antal_BE_Över_16)","v":7.3776857364742428E-3}]
["2. Hjulsystem",127,0,22,0,1.1016524787180772E-2,149,0,2.2167917612148716E-2,1.9285529381309861E-2]
["3. Drivsystem",98,1,24,0,1.2018027040560842E-2,122,1,1.7280502705533253E-2,1.5920269220812841E-2]
{"$rows_left_out":10}
{"sheet":"Pivot BE Komponent","index":20,"n_rows":116,"n_cols":15,"rows_kept":116,"cut":false,"hidden":true,"merged":[]}
[]
[]
[null,"Kolumnetiketter"]
[null,"> 16000",null,"3,5-16 ton",null,"Tunga samtliga",null,null,null,"> 16000",null,"3,5-16 ton",null,"Tunga samtliga"]
["Radetiketter","Summa av 2 Underkänd Med Efterk","Summa av 3 Körförbud","Summa av 2 Underkänd Med Efterk","Summa av 3 Körförbud","Summa av 2 Underkänd Med Efterk","Summa av 3 Körförbud",null,"Radetiketter","Summa av 2 Underkänd Med Efterk","Summa av 3 Körförbud","Summa av 2 Underkänd Med Efterk","Summa av 3 Körförbud","Summa av 2 Underkänd Med Efterk","Summa av 3 Körförbud"]
["1.1.1 Ram",15,0,4,0,19,0,null,"1.1.1 Ram",15,0,4,0,19,0]
["1.1.2 Balkprofil",12,0,4,0,16,0,null,"1.1.2 Balkprofil",12,0,4,0,16,0]
["1.1.3 Plåtyta",0,0,1,0,1,0,null,"1.1.3 Plåtyta",0,0,1,0,1,0]
{"$rows_left_out":109}
{"sheet":"BE Komponent","index":21,"n_rows":561,"n_cols":8,"rows_kept":561,"cut":false,"hidden":true,"merged":[]}
["Viktklass","System","Delsystem","Komponent","2 Underkänd Med Efterk","3 Körförbud","G Godkänd","J Justering"]
["3,5-16 ton","1. Stomme","1.1 Bärande Konstruktion","1.1.1 Ram",4,0,56,0]
["3,5-16 ton","1. Stomme","1.1 Bärande Konstruktion","1.1.2 Balkprofil",4,0,35,0]
["3,5-16 ton","1. Stomme","1.1 Bärande Konstruktion","1.1.3 Plåtyta",1,0,5,0]
["3,5-16 ton","1. Stomme","1.2 Infästning","1.2.1 Infästning Hjulsystem",3,0,16,0]
["3,5-16 ton","1. Stomme","1.2 Infästning","1.2.2 Infästning Drivsystem",0,0,2,0]
["3,5-16 ton","1. Stomme","1.2 Infästning","1.2.5 Infästning Karosseri",1,0,4,0]
["3,5-16 ton","1. Stomme","1.2 Infästning","1.2.6 Infästning Kopplingsanordning",0,0,3,0]
{"$rows_left_out":554}
{"sheet":"Utdata BE Komponent","index":22,"n_rows":115,"n_cols":10,"rows_kept":115,"cut":false,"hidden":false,"merged":[]}
[]
["Andel underkända vid efterkontroll per komponent","Kolumnetiketter"]
[null,"> 16000",null,"3,5-16 ton",null,"3,5-16 ton","Tunga samtliga",null,"Över 16 ton","Tunga, samtliga viktklasser"]
["Radetiketter","Summa av 2 Underkänd Med Efterk","Summa av 3 Körförbud","Summa av 2 Underkänd Med Efterk","Summa av 3 Körförbud","Andel underkända","Summa av 2 Underkänd Med Efterk","Summa av 3 Körförbud","Andel underkända","Andel underkända"]
["1.1.1 Ram",15,0,4,0,{"$f":"SUM(D5:E5)/Antal_BE_35_16","v":2.00300450676014E-3},{"$f":"VLOOKUP($A5,'Pivot BE Komponent'!$I$5:$O$116,6,0)","v":19},{"$f":"VLOOKUP($A5,'Pivot BE Komponent'!$I$5:$O$116,7,0)","v":0},{"$f":"SUM(B5:C5)/Antal_BE_Över_16","v":2.6182579856868565E-3},{"$f":"SUM(G5:H5)/(Antal_BE_Över_16+Antal_BE_35_16)","v":2.4592285788247476E-3}]
["1.1.2 Balkprofil",12,0,4,0,2.00300450676014E-3,{"$f":"VLOOKUP($A6,'Pivot BE Komponent'!$I$5:$O$116,6,0)","v":16},{"$f":"VLOOKUP($A6,'Pivot BE Komponent'!$I$5:$O$116,7,0)","v":0},2.0946063885494853E-3,2.0709293295366298E-3]
["1.1.3 Plåtyta",0,0,1,0,5.00751126690035E-4,{"$f":"VLOOKUP($A7,'Pivot BE Komponent'!$I$5:$O$116,6,0)","v":1},{"$f":"VLOOKUP($A7,'Pivot BE Komponent'!$I$5:$O$116,7,0)","v":0},0,1.2943308309603936E-4]
["1.2.1 Infästning Hjulsystem",6,0,3,0,1.5022533800701052E-3,{"$f":"VLOOKUP($A8,'Pivot BE Komponent'!$I$5:$O$116,6,0)","v":9},{"$f":"VLOOKUP($A8,'Pivot BE Komponent'!$I$5:$O$116,7,0)","v":0},1.0473031942747426E-3,1.1648977478643542E-3]
{"$rows_left_out":108}
{"sheet":"Pivot Däck 2013 Q1","index":23,"n_rows":6,"n_cols":3,"rows_kept":6,"cut":false,"hidden":true,"merged":[]}
["Komponent","2.1.1 Däck"]
[]
["Radetiketter","Summa av 2 Underkänd Med Efterk","Summa av X Underkänd Utan Efterk"]
["> 16000",187,283]
["3,5-16 ton",29,31]
["Tunga samtliga",216,314]

{"sheet":"Däck","index":24,"n_rows":7,"n_cols":4,"rows_kept":7,"cut":false,"hidden":true,"merged":[]}
["Viktklass","Komponent","2 Underkänd Med Efterk","X Underkänd Utan Efterk"]
["3,5-16 ton","2.1.1 Däck",14,11]
["Tunga samtliga","2.1.1 Däck",90,127]
["> 16000","2.1.1 Däck",76,116]
["3,5-16 ton","2.1.1 Däck",15,20]
["Tunga samtliga","2.1.1 Däck",126,187]
["> 16000","2.1.1 Däck",111,167]

{"sheet":"Utdata Däck","index":25,"n_rows":6,"n_cols":5,"rows_kept":6,"cut":false,"hidden":false,"merged":[]}
[]
[null,null,null,"Andel underkända p.g.a. däck, kvartal 1"]
[null,"Summa av 2 Underkänd Med Efterk","Summa av X Underkänd Utan Efterk",2013,2012]
["3,5-16 ton",29,31,{"$f":"SUM(B4:C4)/(1408+992)","v":2.5000000000000001E-2},3.237410071942446E-2]
["> 16000",187,283,{"$f":"SUM(B5:C5)/(5616+3775)","v":5.0047918219571934E-2},5.2595581697558305E-2]
["Tunga, samtliga viktklasser",216,314,{"$f":"SUM(B6:C6)/(1408+992+5616+3775)","v":4.4949537783054876E-2},4.7878756096281921E-2]

{"sheet":"B_Komponent","index":26,"n_rows":595,"n_cols":8,"rows_kept":595,"cut":false,"hidden":true,"merged":[]}
["Viktklass","System","Delsystem","Komponent","2 Underkänd Med Efterk","3 Körförbud","J Justering","X Underkänd Utan Efterk"]
["3,5-16 ton","1. Stomme","1.1 Bärande Konstruktion","1.1.1 Ram",99,1,0,0]
["3,5-16 ton","1. Stomme","1.1 Bärande Konstruktion","1.1.2 Balkprofil",71,0,0,1]
["3,5-16 ton","1. Stomme","1.1 Bärande Konstruktion","1.1.3 Plåtyta",13,0,0,0]
["3,5-16 ton","1. Stomme","1.2 Infästning","1.2.1 Infästning Hjulsystem",27,0,0,0]
["3,5-16 ton","1. Stomme","1.2 Infästning","1.2.2 Infästning Drivsystem",2,0,0,0]
["3,5-16 ton","1. Stomme","1.2 Infästning","1.2.5 Infästning Karosseri",12,0,0,0]
["3,5-16 ton","1. Stomme","1.2 Infästning","1.2.6 Infästning Kopplingsanordning",5,0,0,0]
{"$rows_left_out":588}
{"sheet":"Märken","index":27,"n_rows":164,"n_cols":8,"rows_kept":164,"cut":false,"hidden":true,"merged":[]}
["Antal besiktade\nsom värden","Märke","0 Godkänd","2 Underkänd Med Efterk","3 Körförbud","6 Underkänd Utan Efterk","U Underkänd Fle","Utfall"]
["3,5-16 ton","VOLVO",1063,1021,11,620,0,2715]
["3,5-16 ton","MERCEDES-BENZ",679,736,9,458,0,1882]
["3,5-16 ton","SCANIA/SCANIA-VABIS",299,119,2,111,0,531]
["3,5-16 ton","IVECO",159,189,1,108,0,457]
["3,5-16 ton","CHEVROLET",122,128,0,64,0,314]
["3,5-16 ton","VW",106,99,1,41,0,247]
["3,5-16 ton","FORD",68,88,2,36,0,194]
{"$rows_left_out":157}
{"sheet":"BE","index":28,"n_rows":309,"n_cols":7,"rows_kept":309,"cut":false,"hidden":true,"merged":[]}
["Viktklass","Stn","Län","0 Godkänd","2 Underkänd Med Efterk","3 Körförbud","Utfall"]
["3,5-16 ton","0112 Arvidsjaur","25 Norrbottens län",12,2,0,14]
["3,5-16 ton","0114 Gällivare","25 Norrbottens län",21,8,0,29]
["3,5-16 ton","0115 Haparanda","25 Norrbottens län",8,2,0,10]
["3,5-16 ton","0116 Jokkmokk","25 Norrbottens län",3,0,0,3]
["3,5-16 ton","0121 Pajala","25 Norrbottens län",3,0,0,3]
["3,5-16 ton","0123 Älvsbyn","25 Norrbottens län",7,4,0,11]
["3,5-16 ton","0125 Övertorneå","25 Norrbottens län",20,3,0,23]
{"$rows_left_out":302}
{"sheet":"Tunga totalt","index":29,"n_rows":102,"n_cols":8,"rows_kept":102,"cut":false,"hidden":true,"merged":[]}
[]
["Stn","Län","0 Godkänd","2 Underkänd Med Efterk","3 Körförbud","6 Underkänd Utan Efterk","U Underkänd Fle","Utfall"]
["0876 Jönköping-Torsvik","6 Jönköpings län",620,592,4,411,0,1627]
["0317 Gävle-Sörby Urfjäll","21 Gävleborgs län",362,706,9,208,0,1285]
["0418 Sollentuna","1 Stockholms län",392,513,6,342,0,1253]
["0523 Västerås-Tunbytorp","19 Västmanlands län",328,579,8,260,0,1175]
["0967 Helsingborg-Ättekulla","12 Skåne län",407,446,1,296,0,1150]
["0536 Norrköping-Herstadberg","5 Östergötlands län",402,442,6,237,1,1088]
{"$rows_left_out":94}